Mailing List Archive

cmf-tests - OK: 3, UNKNOWN: 1
This is the summary for test reports received on the
cmf-tests list between 2011-07-03 00:00:00 UTC and 2011-07-04 00:00:00 UTC:

See the footnotes for test reports of unsuccessful builds.

An up-to date view of the builders is also available in our
buildbot documentation:
http://docs.zope.org/zopetoolkit/process/buildbots.html#the-nightly-builds

Reports received
----------------

CMF-2.2 Zope-2.12 Python-2.6.6 : Linux
CMF-2.2 Zope-2.13 Python-2.6.6 : Linux
CMF-trunk Zope-2.13 Python-2.6.6 : Linux
[1] FAILED (failures=1, errors=4) : CMF-trunk Zope-trunk Python-2.6.6 : Linux

Non-OK results
--------------

[1] UNKNOWN FAILED (failures=1, errors=4) : CMF-trunk Zope-trunk Python-2.6.6 : Linux
https://mail.zope.org/pipermail/cmf-tests/2011-July/014957.html


_______________________________________________
Zope-CMF maillist - Zope-CMF@zope.org
https://mail.zope.org/mailman/listinfo/zope-cmf

See https://bugs.launchpad.net/zope-cmf/ for bug reports and feature requests
Re: cmf-tests - OK: 3, UNKNOWN: 1 [ In reply to ]
Am 05.07.2011, 07:00 Uhr, schrieb CMF tests summarizer <noreply@zope.org>:

> [1] UNKNOWN FAILED (failures=1, errors=4) : CMF-trunk Zope-trunk
> Python-2.6.6 : Linux
> https://mail.zope.org/pipermail/cmf-tests/2011-July/014957.html

All errors are related to FSMetaData

Error in test test_basicPermissions
(Products.CMFCore.tests.test_FSMetadata.FSMetadata)
Traceback (most recent call last):
File "/usr/local/python2.6/lib/python2.6/unittest.py", line 279, in run
testMethod()
File
"/home/stefan/autotest/temp/python26-zope214-cmf23/src/Products.CMFCore/Products/CMFCore/tests/test_FSMetadata.py",
line 43, in test_basicPermissions
['Manager','Anonymous'])
File
"/home/stefan/autotest/temp/python26-zope214-cmf23/src/Products.CMFCore/Products/CMFCore/tests/test_FSSecurity.py",
line 51, in _checkSettings
% permissionname)
ValueError: 'Access contents information' not found in inherited
permissions.

--
Charlie Clark
Managing Director
Clark Consulting & Research
German Office
Helmholtzstr. 20
Düsseldorf
D- 40215
Tel: +49-211-600-3657
Mobile: +49-178-782-6226
_______________________________________________
Zope-CMF maillist - Zope-CMF@zope.org
https://mail.zope.org/mailman/listinfo/zope-cmf

See https://bugs.launchpad.net/zope-cmf/ for bug reports and feature requests
Re: cmf-tests - OK: 3, UNKNOWN: 1 [ In reply to ]
On Tue, Jul 5, 2011 at 12:44 PM, Charlie Clark
<charlie.clark@clark-consulting.eu> wrote:
> Am 05.07.2011, 07:00 Uhr, schrieb CMF tests summarizer <noreply@zope.org>:
>
>> [1]    UNKNOWN FAILED (failures=1, errors=4) : CMF-trunk Zope-trunk
>> Python-2.6.6 : Linux
>>        https://mail.zope.org/pipermail/cmf-tests/2011-July/014957.html
>
> All errors are related to FSMetaData
>
> Error in test test_basicPermissions
> (Products.CMFCore.tests.test_FSMetadata.FSMetadata)
> Traceback (most recent call last):
>   File "/usr/local/python2.6/lib/python2.6/unittest.py", line 279, in run
>     testMethod()
>   File
> "/home/stefan/autotest/temp/python26-zope214-cmf23/src/Products.CMFCore/Products/CMFCore/tests/test_FSMetadata.py",
> line 43, in test_basicPermissions
>     ['Manager','Anonymous'])
>   File
> "/home/stefan/autotest/temp/python26-zope214-cmf23/src/Products.CMFCore/Products/CMFCore/tests/test_FSSecurity.py",
> line 51, in _checkSettings
>     % permissionname)
> ValueError: 'Access contents information' not found in inherited
> permissions.

Yes, these are my fault. I kept testing the CMF against Zope trunk for
the most part of the weekend, but didn't run the tests anymore for the
last round of changes.

Not sure what exactly caused these, but I'll have a look.

Hanno
_______________________________________________
Zope-CMF maillist - Zope-CMF@zope.org
https://mail.zope.org/mailman/listinfo/zope-cmf

See https://bugs.launchpad.net/zope-cmf/ for bug reports and feature requests
cmf-tests - OK: 3, UNKNOWN: 1 [ In reply to ]
This is the summary for test reports received on the
cmf-tests list between 2011-07-04 00:00:00 UTC and 2011-07-05 00:00:00 UTC:

See the footnotes for test reports of unsuccessful builds.

An up-to date view of the builders is also available in our
buildbot documentation:
http://docs.zope.org/zopetoolkit/process/buildbots.html#the-nightly-builds

Reports received
----------------

CMF-2.2 Zope-2.12 Python-2.6.6 : Linux
CMF-2.2 Zope-2.13 Python-2.6.6 : Linux
CMF-trunk Zope-2.13 Python-2.6.6 : Linux
[1] FAILED (failures=1, errors=4) : CMF-trunk Zope-trunk Python-2.6.6 : Linux

Non-OK results
--------------

[1] UNKNOWN FAILED (failures=1, errors=4) : CMF-trunk Zope-trunk Python-2.6.6 : Linux
https://mail.zope.org/pipermail/cmf-tests/2011-July/014961.html


_______________________________________________
Zope-CMF maillist - Zope-CMF@zope.org
https://mail.zope.org/mailman/listinfo/zope-cmf

See https://bugs.launchpad.net/zope-cmf/ for bug reports and feature requests
cmf-tests - OK: 3, UNKNOWN: 1 [ In reply to ]
This is the summary for test reports received on the
cmf-tests list between 2011-07-05 00:00:00 UTC and 2011-07-06 00:00:00 UTC:

See the footnotes for test reports of unsuccessful builds.

An up-to date view of the builders is also available in our
buildbot documentation:
http://docs.zope.org/zopetoolkit/process/buildbots.html#the-nightly-builds

Reports received
----------------

CMF-2.2 Zope-2.12 Python-2.6.6 : Linux
CMF-2.2 Zope-2.13 Python-2.6.6 : Linux
CMF-trunk Zope-2.13 Python-2.6.6 : Linux
[1] FAILED (failures=1, errors=4) : CMF-trunk Zope-trunk Python-2.6.6 : Linux

Non-OK results
--------------

[1] UNKNOWN FAILED (failures=1, errors=4) : CMF-trunk Zope-trunk Python-2.6.6 : Linux
https://mail.zope.org/pipermail/cmf-tests/2011-July/014965.html


_______________________________________________
Zope-CMF maillist - Zope-CMF@zope.org
https://mail.zope.org/mailman/listinfo/zope-cmf

See https://bugs.launchpad.net/zope-cmf/ for bug reports and feature requests
cmf-tests - OK: 3, UNKNOWN: 1 [ In reply to ]
This is the summary for test reports received on the
cmf-tests list between 2011-07-06 00:00:00 UTC and 2011-07-07 00:00:00 UTC:

See the footnotes for test reports of unsuccessful builds.

An up-to date view of the builders is also available in our
buildbot documentation:
http://docs.zope.org/zopetoolkit/process/buildbots.html#the-nightly-builds

Reports received
----------------

CMF-2.2 Zope-2.12 Python-2.6.6 : Linux
CMF-2.2 Zope-2.13 Python-2.6.6 : Linux
CMF-trunk Zope-2.13 Python-2.6.6 : Linux
[1] FAILED (failures=1, errors=4) : CMF-trunk Zope-trunk Python-2.6.6 : Linux

Non-OK results
--------------

[1] UNKNOWN FAILED (failures=1, errors=4) : CMF-trunk Zope-trunk Python-2.6.6 : Linux
https://mail.zope.org/pipermail/cmf-tests/2011-July/014969.html


_______________________________________________
Zope-CMF maillist - Zope-CMF@zope.org
https://mail.zope.org/mailman/listinfo/zope-cmf

See https://bugs.launchpad.net/zope-cmf/ for bug reports and feature requests
cmf-tests - OK: 3, UNKNOWN: 1 [ In reply to ]
This is the summary for test reports received on the
cmf-tests list between 2011-07-07 00:00:00 UTC and 2011-07-08 00:00:00 UTC:

See the footnotes for test reports of unsuccessful builds.

An up-to date view of the builders is also available in our
buildbot documentation:
http://docs.zope.org/zopetoolkit/process/buildbots.html#the-nightly-builds

Reports received
----------------

CMF-2.2 Zope-2.12 Python-2.6.6 : Linux
CMF-2.2 Zope-2.13 Python-2.6.6 : Linux
CMF-trunk Zope-2.13 Python-2.6.6 : Linux
[1] FAILED (failures=1, errors=4) : CMF-trunk Zope-trunk Python-2.6.6 : Linux

Non-OK results
--------------

[1] UNKNOWN FAILED (failures=1, errors=4) : CMF-trunk Zope-trunk Python-2.6.6 : Linux
https://mail.zope.org/pipermail/cmf-tests/2011-July/014973.html


_______________________________________________
Zope-CMF maillist - Zope-CMF@zope.org
https://mail.zope.org/mailman/listinfo/zope-cmf

See https://bugs.launchpad.net/zope-cmf/ for bug reports and feature requests
cmf-tests - OK: 3, UNKNOWN: 1 [ In reply to ]
This is the summary for test reports received on the
cmf-tests list between 2011-07-08 00:00:00 UTC and 2011-07-09 00:00:00 UTC:

See the footnotes for test reports of unsuccessful builds.

An up-to date view of the builders is also available in our
buildbot documentation:
http://docs.zope.org/zopetoolkit/process/buildbots.html#the-nightly-builds

Reports received
----------------

CMF-2.2 Zope-2.12 Python-2.6.6 : Linux
CMF-2.2 Zope-2.13 Python-2.6.6 : Linux
CMF-trunk Zope-2.13 Python-2.6.6 : Linux
[1] FAILED (failures=1, errors=4) : CMF-trunk Zope-trunk Python-2.6.6 : Linux

Non-OK results
--------------

[1] UNKNOWN FAILED (failures=1, errors=4) : CMF-trunk Zope-trunk Python-2.6.6 : Linux
https://mail.zope.org/pipermail/cmf-tests/2011-July/014977.html


_______________________________________________
Zope-CMF maillist - Zope-CMF@zope.org
https://mail.zope.org/mailman/listinfo/zope-cmf

See https://bugs.launchpad.net/zope-cmf/ for bug reports and feature requests
cmf-tests - OK: 3, UNKNOWN: 1 [ In reply to ]
This is the summary for test reports received on the
cmf-tests list between 2011-07-09 00:00:00 UTC and 2011-07-10 00:00:00 UTC:

See the footnotes for test reports of unsuccessful builds.

An up-to date view of the builders is also available in our
buildbot documentation:
http://docs.zope.org/zopetoolkit/process/buildbots.html#the-nightly-builds

Reports received
----------------

CMF-2.2 Zope-2.12 Python-2.6.6 : Linux
CMF-2.2 Zope-2.13 Python-2.6.6 : Linux
CMF-trunk Zope-2.13 Python-2.6.6 : Linux
[1] FAILED (failures=1, errors=4) : CMF-trunk Zope-trunk Python-2.6.6 : Linux

Non-OK results
--------------

[1] UNKNOWN FAILED (failures=1, errors=4) : CMF-trunk Zope-trunk Python-2.6.6 : Linux
https://mail.zope.org/pipermail/cmf-tests/2011-July/014981.html


_______________________________________________
Zope-CMF maillist - Zope-CMF@zope.org
https://mail.zope.org/mailman/listinfo/zope-cmf

See https://bugs.launchpad.net/zope-cmf/ for bug reports and feature requests
cmf-tests - OK: 3, UNKNOWN: 1 [ In reply to ]
This is the summary for test reports received on the
cmf-tests list between 2011-07-10 00:00:00 UTC and 2011-07-11 00:00:00 UTC:

See the footnotes for test reports of unsuccessful builds.

An up-to date view of the builders is also available in our
buildbot documentation:
http://docs.zope.org/zopetoolkit/process/buildbots.html#the-nightly-builds

Reports received
----------------

CMF-2.2 Zope-2.12 Python-2.6.6 : Linux
CMF-2.2 Zope-2.13 Python-2.6.6 : Linux
CMF-trunk Zope-2.13 Python-2.6.6 : Linux
[1] FAILED (failures=1, errors=4) : CMF-trunk Zope-trunk Python-2.6.6 : Linux

Non-OK results
--------------

[1] UNKNOWN FAILED (failures=1, errors=4) : CMF-trunk Zope-trunk Python-2.6.6 : Linux
https://mail.zope.org/pipermail/cmf-tests/2011-July/014985.html


_______________________________________________
Zope-CMF maillist - Zope-CMF@zope.org
https://mail.zope.org/mailman/listinfo/zope-cmf

See https://bugs.launchpad.net/zope-cmf/ for bug reports and feature requests
cmf-tests - OK: 3, UNKNOWN: 1 [ In reply to ]
This is the summary for test reports received on the
cmf-tests list between 2011-07-11 00:00:00 UTC and 2011-07-12 00:00:00 UTC:

See the footnotes for test reports of unsuccessful builds.

An up-to date view of the builders is also available in our
buildbot documentation:
http://docs.zope.org/zopetoolkit/process/buildbots.html#the-nightly-builds

Reports received
----------------

CMF-2.2 Zope-2.12 Python-2.6.6 : Linux
CMF-2.2 Zope-2.13 Python-2.6.6 : Linux
CMF-trunk Zope-2.13 Python-2.6.6 : Linux
[1] FAILED (failures=1, errors=4) : CMF-trunk Zope-trunk Python-2.6.6 : Linux

Non-OK results
--------------

[1] UNKNOWN FAILED (failures=1, errors=4) : CMF-trunk Zope-trunk Python-2.6.6 : Linux
https://mail.zope.org/pipermail/cmf-tests/2011-July/014989.html


_______________________________________________
Zope-CMF maillist - Zope-CMF@zope.org
https://mail.zope.org/mailman/listinfo/zope-cmf

See https://bugs.launchpad.net/zope-cmf/ for bug reports and feature requests
cmf-tests - OK: 3, UNKNOWN: 1 [ In reply to ]
This is the summary for test reports received on the
cmf-tests list between 2011-07-12 00:00:00 UTC and 2011-07-13 00:00:00 UTC:

See the footnotes for test reports of unsuccessful builds.

An up-to date view of the builders is also available in our
buildbot documentation:
http://docs.zope.org/zopetoolkit/process/buildbots.html#the-nightly-builds

Reports received
----------------

CMF-2.2 Zope-2.12 Python-2.6.6 : Linux
CMF-2.2 Zope-2.13 Python-2.6.6 : Linux
CMF-trunk Zope-2.13 Python-2.6.6 : Linux
[1] FAILED (failures=1, errors=4) : CMF-trunk Zope-trunk Python-2.6.6 : Linux

Non-OK results
--------------

[1] UNKNOWN FAILED (failures=1, errors=4) : CMF-trunk Zope-trunk Python-2.6.6 : Linux
https://mail.zope.org/pipermail/cmf-tests/2011-July/014993.html


_______________________________________________
Zope-CMF maillist - Zope-CMF@zope.org
https://mail.zope.org/mailman/listinfo/zope-cmf

See https://bugs.launchpad.net/zope-cmf/ for bug reports and feature requests
cmf-tests - OK: 3, UNKNOWN: 1 [ In reply to ]
This is the summary for test reports received on the
cmf-tests list between 2011-07-13 00:00:00 UTC and 2011-07-14 00:00:00 UTC:

See the footnotes for test reports of unsuccessful builds.

An up-to date view of the builders is also available in our
buildbot documentation:
http://docs.zope.org/zopetoolkit/process/buildbots.html#the-nightly-builds

Reports received
----------------

CMF-2.2 Zope-2.12 Python-2.6.6 : Linux
CMF-2.2 Zope-2.13 Python-2.6.6 : Linux
CMF-trunk Zope-2.13 Python-2.6.6 : Linux
[1] FAILED (failures=3, errors=4) : CMF-trunk Zope-trunk Python-2.6.6 : Linux

Non-OK results
--------------

[1] UNKNOWN FAILED (failures=3, errors=4) : CMF-trunk Zope-trunk Python-2.6.6 : Linux
https://mail.zope.org/pipermail/cmf-tests/2011-July/014997.html


_______________________________________________
Zope-CMF maillist - Zope-CMF@zope.org
https://mail.zope.org/mailman/listinfo/zope-cmf

See https://bugs.launchpad.net/zope-cmf/ for bug reports and feature requests
cmf-tests - OK: 3, UNKNOWN: 1 [ In reply to ]
This is the summary for test reports received on the
cmf-tests list between 2011-07-14 00:00:00 UTC and 2011-07-15 00:00:00 UTC:

See the footnotes for test reports of unsuccessful builds.

An up-to date view of the builders is also available in our
buildbot documentation:
http://docs.zope.org/zopetoolkit/process/buildbots.html#the-nightly-builds

Reports received
----------------

CMF-2.2 Zope-2.12 Python-2.6.6 : Linux
CMF-2.2 Zope-2.13 Python-2.6.6 : Linux
CMF-trunk Zope-2.13 Python-2.6.6 : Linux
[1] FAILED (failures=5, errors=4) : CMF-trunk Zope-trunk Python-2.6.6 : Linux

Non-OK results
--------------

[1] UNKNOWN FAILED (failures=5, errors=4) : CMF-trunk Zope-trunk Python-2.6.6 : Linux
https://mail.zope.org/pipermail/cmf-tests/2011-July/015001.html


_______________________________________________
Zope-CMF maillist - Zope-CMF@zope.org
https://mail.zope.org/mailman/listinfo/zope-cmf

See https://bugs.launchpad.net/zope-cmf/ for bug reports and feature requests
cmf-tests - OK: 3, UNKNOWN: 1 [ In reply to ]
This is the summary for test reports received on the
cmf-tests list between 2011-07-15 00:00:00 UTC and 2011-07-16 00:00:00 UTC:

See the footnotes for test reports of unsuccessful builds.

An up-to date view of the builders is also available in our
buildbot documentation:
http://docs.zope.org/zopetoolkit/process/buildbots.html#the-nightly-builds

Reports received
----------------

CMF-2.2 Zope-2.12 Python-2.6.6 : Linux
CMF-2.2 Zope-2.13 Python-2.6.6 : Linux
CMF-trunk Zope-2.13 Python-2.6.6 : Linux
[1] FAILED (failures=5, errors=4) : CMF-trunk Zope-trunk Python-2.6.6 : Linux

Non-OK results
--------------

[1] UNKNOWN FAILED (failures=5, errors=4) : CMF-trunk Zope-trunk Python-2.6.6 : Linux
https://mail.zope.org/pipermail/cmf-tests/2011-July/015005.html


_______________________________________________
Zope-CMF maillist - Zope-CMF@zope.org
https://mail.zope.org/mailman/listinfo/zope-cmf

See https://bugs.launchpad.net/zope-cmf/ for bug reports and feature requests
cmf-tests - OK: 3, UNKNOWN: 1 [ In reply to ]
This is the summary for test reports received on the
cmf-tests list between 2011-07-16 00:00:00 UTC and 2011-07-17 00:00:00 UTC:

See the footnotes for test reports of unsuccessful builds.

An up-to date view of the builders is also available in our
buildbot documentation:
http://docs.zope.org/zopetoolkit/process/buildbots.html#the-nightly-builds

Reports received
----------------

CMF-2.2 Zope-2.12 Python-2.6.6 : Linux
CMF-2.2 Zope-2.13 Python-2.6.6 : Linux
CMF-trunk Zope-2.13 Python-2.6.6 : Linux
[1] FAILED (failures=5, errors=4) : CMF-trunk Zope-trunk Python-2.6.6 : Linux

Non-OK results
--------------

[1] UNKNOWN FAILED (failures=5, errors=4) : CMF-trunk Zope-trunk Python-2.6.6 : Linux
https://mail.zope.org/pipermail/cmf-tests/2011-July/015009.html


_______________________________________________
Zope-CMF maillist - Zope-CMF@zope.org
https://mail.zope.org/mailman/listinfo/zope-cmf

See https://bugs.launchpad.net/zope-cmf/ for bug reports and feature requests
cmf-tests - OK: 3, UNKNOWN: 1 [ In reply to ]
This is the summary for test reports received on the
cmf-tests list between 2011-07-17 00:00:00 UTC and 2011-07-18 00:00:00 UTC:

See the footnotes for test reports of unsuccessful builds.

An up-to date view of the builders is also available in our
buildbot documentation:
http://docs.zope.org/zopetoolkit/process/buildbots.html#the-nightly-builds

Reports received
----------------

CMF-2.2 Zope-2.12 Python-2.6.6 : Linux
CMF-2.2 Zope-2.13 Python-2.6.6 : Linux
CMF-trunk Zope-2.13 Python-2.6.6 : Linux
[1] FAILED (failures=3, errors=4) : CMF-trunk Zope-trunk Python-2.6.6 : Linux

Non-OK results
--------------

[1] UNKNOWN FAILED (failures=3, errors=4) : CMF-trunk Zope-trunk Python-2.6.6 : Linux
https://mail.zope.org/pipermail/cmf-tests/2011-July/015013.html


_______________________________________________
Zope-CMF maillist - Zope-CMF@zope.org
https://mail.zope.org/mailman/listinfo/zope-cmf

See https://bugs.launchpad.net/zope-cmf/ for bug reports and feature requests
cmf-tests - OK: 3, UNKNOWN: 1 [ In reply to ]
This is the summary for test reports received on the
cmf-tests list between 2011-07-18 00:00:00 UTC and 2011-07-19 00:00:00 UTC:

See the footnotes for test reports of unsuccessful builds.

An up-to date view of the builders is also available in our
buildbot documentation:
http://docs.zope.org/zopetoolkit/process/buildbots.html#the-nightly-builds

Reports received
----------------

CMF-2.2 Zope-2.12 Python-2.6.6 : Linux
CMF-2.2 Zope-2.13 Python-2.6.6 : Linux
CMF-trunk Zope-2.13 Python-2.6.6 : Linux
[1] FAILED (failures=3, errors=4) : CMF-trunk Zope-trunk Python-2.6.6 : Linux

Non-OK results
--------------

[1] UNKNOWN FAILED (failures=3, errors=4) : CMF-trunk Zope-trunk Python-2.6.6 : Linux
https://mail.zope.org/pipermail/cmf-tests/2011-July/015017.html


_______________________________________________
Zope-CMF maillist - Zope-CMF@zope.org
https://mail.zope.org/mailman/listinfo/zope-cmf

See https://bugs.launchpad.net/zope-cmf/ for bug reports and feature requests
cmf-tests - OK: 3, UNKNOWN: 1 [ In reply to ]
This is the summary for test reports received on the
cmf-tests list between 2011-07-19 00:00:00 UTC and 2011-07-20 00:00:00 UTC:

See the footnotes for test reports of unsuccessful builds.

An up-to date view of the builders is also available in our
buildbot documentation:
http://docs.zope.org/zopetoolkit/process/buildbots.html#the-nightly-builds

Reports received
----------------

CMF-2.2 Zope-2.12 Python-2.6.6 : Linux
CMF-2.2 Zope-2.13 Python-2.6.6 : Linux
CMF-trunk Zope-2.13 Python-2.6.6 : Linux
[1] FAILED (failures=3, errors=4) : CMF-trunk Zope-trunk Python-2.6.6 : Linux

Non-OK results
--------------

[1] UNKNOWN FAILED (failures=3, errors=4) : CMF-trunk Zope-trunk Python-2.6.6 : Linux
https://mail.zope.org/pipermail/cmf-tests/2011-July/015021.html


_______________________________________________
Zope-CMF maillist - Zope-CMF@zope.org
https://mail.zope.org/mailman/listinfo/zope-cmf

See https://bugs.launchpad.net/zope-cmf/ for bug reports and feature requests
cmf-tests - OK: 3, UNKNOWN: 1 [ In reply to ]
This is the summary for test reports received on the
cmf-tests list between 2011-07-20 00:00:00 UTC and 2011-07-21 00:00:00 UTC:

See the footnotes for test reports of unsuccessful builds.

An up-to date view of the builders is also available in our
buildbot documentation:
http://docs.zope.org/zopetoolkit/process/buildbots.html#the-nightly-builds

Reports received
----------------

CMF-2.2 Zope-2.12 Python-2.6.6 : Linux
CMF-2.2 Zope-2.13 Python-2.6.6 : Linux
CMF-trunk Zope-2.13 Python-2.6.6 : Linux
[1] FAILED (failures=3, errors=4) : CMF-trunk Zope-trunk Python-2.6.6 : Linux

Non-OK results
--------------

[1] UNKNOWN FAILED (failures=3, errors=4) : CMF-trunk Zope-trunk Python-2.6.6 : Linux
https://mail.zope.org/pipermail/cmf-tests/2011-July/015025.html


_______________________________________________
Zope-CMF maillist - Zope-CMF@zope.org
https://mail.zope.org/mailman/listinfo/zope-cmf

See https://bugs.launchpad.net/zope-cmf/ for bug reports and feature requests
cmf-tests - OK: 3, UNKNOWN: 1 [ In reply to ]
This is the summary for test reports received on the
cmf-tests list between 2011-07-21 00:00:00 UTC and 2011-07-22 00:00:00 UTC:

See the footnotes for test reports of unsuccessful builds.

An up-to date view of the builders is also available in our
buildbot documentation:
http://docs.zope.org/zopetoolkit/process/buildbots.html#the-nightly-builds

Reports received
----------------

CMF-2.2 Zope-2.12 Python-2.6.6 : Linux
CMF-2.2 Zope-2.13 Python-2.6.6 : Linux
CMF-trunk Zope-2.13 Python-2.6.6 : Linux
[1] FAILED (failures=3, errors=4) : CMF-trunk Zope-trunk Python-2.6.6 : Linux

Non-OK results
--------------

[1] UNKNOWN FAILED (failures=3, errors=4) : CMF-trunk Zope-trunk Python-2.6.6 : Linux
https://mail.zope.org/pipermail/cmf-tests/2011-July/015029.html


_______________________________________________
Zope-CMF maillist - Zope-CMF@zope.org
https://mail.zope.org/mailman/listinfo/zope-cmf

See https://bugs.launchpad.net/zope-cmf/ for bug reports and feature requests
cmf-tests - OK: 3, UNKNOWN: 1 [ In reply to ]
This is the summary for test reports received on the
cmf-tests list between 2011-07-22 00:00:00 UTC and 2011-07-23 00:00:00 UTC:

See the footnotes for test reports of unsuccessful builds.

An up-to date view of the builders is also available in our
buildbot documentation:
http://docs.zope.org/zopetoolkit/process/buildbots.html#the-nightly-builds

Reports received
----------------

CMF-2.2 Zope-2.12 Python-2.6.6 : Linux
CMF-2.2 Zope-2.13 Python-2.6.6 : Linux
CMF-trunk Zope-2.13 Python-2.6.6 : Linux
[1] FAILED (failures=3, errors=4) : CMF-trunk Zope-trunk Python-2.6.6 : Linux

Non-OK results
--------------

[1] UNKNOWN FAILED (failures=3, errors=4) : CMF-trunk Zope-trunk Python-2.6.6 : Linux
https://mail.zope.org/pipermail/cmf-tests/2011-July/015033.html


_______________________________________________
Zope-CMF maillist - Zope-CMF@zope.org
https://mail.zope.org/mailman/listinfo/zope-cmf

See https://bugs.launchpad.net/zope-cmf/ for bug reports and feature requests
cmf-tests - OK: 3, UNKNOWN: 1 [ In reply to ]
This is the summary for test reports received on the
cmf-tests list between 2011-07-23 00:00:00 UTC and 2011-07-24 00:00:00 UTC:

See the footnotes for test reports of unsuccessful builds.

An up-to date view of the builders is also available in our
buildbot documentation:
http://docs.zope.org/zopetoolkit/process/buildbots.html#the-nightly-builds

Reports received
----------------

CMF-2.2 Zope-2.12 Python-2.6.6 : Linux
CMF-2.2 Zope-2.13 Python-2.6.6 : Linux
CMF-trunk Zope-2.13 Python-2.6.6 : Linux
[1] FAILED (failures=3, errors=4) : CMF-trunk Zope-trunk Python-2.6.6 : Linux

Non-OK results
--------------

[1] UNKNOWN FAILED (failures=3, errors=4) : CMF-trunk Zope-trunk Python-2.6.6 : Linux
https://mail.zope.org/pipermail/cmf-tests/2011-July/015037.html


_______________________________________________
Zope-CMF maillist - Zope-CMF@zope.org
https://mail.zope.org/mailman/listinfo/zope-cmf

See https://bugs.launchpad.net/zope-cmf/ for bug reports and feature requests
cmf-tests - OK: 3, UNKNOWN: 1 [ In reply to ]
This is the summary for test reports received on the
cmf-tests list between 2011-07-24 00:00:00 UTC and 2011-07-25 00:00:00 UTC:

See the footnotes for test reports of unsuccessful builds.

An up-to date view of the builders is also available in our
buildbot documentation:
http://docs.zope.org/zopetoolkit/process/buildbots.html#the-nightly-builds

Reports received
----------------

CMF-2.2 Zope-2.12 Python-2.6.6 : Linux
CMF-2.2 Zope-2.13 Python-2.6.6 : Linux
CMF-trunk Zope-2.13 Python-2.6.6 : Linux
[1] FAILED (failures=3, errors=4) : CMF-trunk Zope-trunk Python-2.6.6 : Linux

Non-OK results
--------------

[1] UNKNOWN FAILED (failures=3, errors=4) : CMF-trunk Zope-trunk Python-2.6.6 : Linux
https://mail.zope.org/pipermail/cmf-tests/2011-July/015041.html


_______________________________________________
Zope-CMF maillist - Zope-CMF@zope.org
https://mail.zope.org/mailman/listinfo/zope-cmf

See https://bugs.launchpad.net/zope-cmf/ for bug reports and feature requests
cmf-tests - OK: 3, UNKNOWN: 1 [ In reply to ]
This is the summary for test reports received on the
cmf-tests list between 2011-07-25 00:00:00 UTC and 2011-07-26 00:00:00 UTC:

See the footnotes for test reports of unsuccessful builds.

An up-to date view of the builders is also available in our
buildbot documentation:
http://docs.zope.org/zopetoolkit/process/buildbots.html#the-nightly-builds

Reports received
----------------

CMF-2.2 Zope-2.12 Python-2.6.6 : Linux
CMF-2.2 Zope-2.13 Python-2.6.6 : Linux
CMF-trunk Zope-2.13 Python-2.6.6 : Linux
[1] FAILED (failures=3, errors=4) : CMF-trunk Zope-trunk Python-2.6.6 : Linux

Non-OK results
--------------

[1] UNKNOWN FAILED (failures=3, errors=4) : CMF-trunk Zope-trunk Python-2.6.6 : Linux
https://mail.zope.org/pipermail/cmf-tests/2011-July/015045.html


_______________________________________________
Zope-CMF maillist - Zope-CMF@zope.org
https://mail.zope.org/mailman/listinfo/zope-cmf

See https://bugs.launchpad.net/zope-cmf/ for bug reports and feature requests

1 2 3  View All