Mailing List Archive

problem building 0.97.2 OpenSuSE 11.0
Hi list.

I'm in trouble building ClamAV 0.97.2:

make[4]: Entering directory `/usr/local/src/clamav-0.97.2/libclamav'
GEN version.h.tmp
GEN version.h
c++/.libs/libclamavcxx.a: member
c++/.libs/libclamavcxx.a(SelectionDAGBuilder.o) in archive is not an
collect2: ld returned 1 exit status
make[4]: *** [] Error 1
make[4]: Leaving directory `/usr/local/src/clamav-0.97.2/libclamav'
make[3]: *** [all-recursive] Error 1
make[3]: Leaving directory `/usr/local/src/clamav-0.97.2/libclamav'
make[2]: *** [all] Error 2
make[2]: Leaving directory `/usr/local/src/clamav-0.97.2/libclamav'
make[1]: *** [all-recursive] Error 1
make[1]: Leaving directory `/usr/local/src/clamav-0.97.2'
make: *** [all] Error 2

My distro is OpenSuSE 11.0



This message was sent using IMP, the Internet Messaging Program.

Please submit your patches to our Bugzilla: